BDBM82557 I-ABA::IABA::N(6)-(4-Amino-3-iodobenzyl)adenosine
SMILES Nc1ccc(CNc2ncnc3n(cnc23)[C@@H]2O[C@H](CO)[C@@H](O)[C@H]2O)cc1I
InChI Key InChIKey=REGZQZHKIFOMRK-LSCFUAHRSA-N
Data  4 KI
  Tab Delimited (TSV)   2D SDfile   Computed 3D by Vconf -m prep SDfile
Find this compound or compounds like it in BindingDB:
Activity Spreadsheet -- Enzyme Inhibition Constant Data from BindingDB
Found 2 hits for monomerid = 82557
TargetAdenosine receptor A1(Rattus norvegicus (rat))
Niddk
Curated by ChEMBL
LigandPNGBDBM82557(I-ABA | IABA | N(6)-(4-Amino-3-iodobenzyl)adenosin...)
Affinity DataKi:  0.700nM. Assay description: Binding affinity for Adenosine A1 receptor using [3H]- CHA or [3H]- PIA
In DepthDetails ArticlePubMed
TargetAdenosine receptor A1(Oryctolagus cuniculus (Rabbit))
Pfizer
Curated by PDSP Ki Database
LigandPNGBDBM82557(I-ABA | IABA | N(6)-(4-Amino-3-iodobenzyl)adenosin...)
In DepthDetails PubMed